BDBM50100716 5-(1-Methyl-pyrrolidin-2-yl)-pyridin-2-ylamine::CHEMBL70774::US10667515, Compound 6-AN
SMILES CN1CCCC1c1ccc(N)nc1
InChI Key InChIKey=FARGKMUKCFJLSU-UHFFFAOYSA-N
Data  1 KI  1 EC50
  Tab Delimited (TSV)   2D SDfile   Computed 3D by Vconf -m prep SDfile
Find this compound or compounds like it in BindingDB:
Activity Spreadsheet -- Enzyme Inhibition Constant Data from BindingDB
Found 1 hit for monomerid = 50100716
TargetResistance to inhibitors of cholinesterase protein 3(Pig roundworm)
Iowa State University Research Foundation
US Patent
LigandPNGBDBM50100716(5-(1-Methyl-pyrrolidin-2-yl)-pyridin-2-ylamine | C...)
Affinity DataEC50:  1.22E+4nM. Assay description: Nematode eggs are isolated from fresh feces by centrifugation and flotation. The eggs are washed and inspected to confirm embryonation has not starte...
In DepthDetails US Patent